No results found

Your search did not match any results.

We suggest you try the following to help find what you’re looking for:

  • Check the spelling of your keyword search.
  • Use synonyms for the keyword you typed, for example, try “application” instead of “software.”
  • Try one of the popular searches shown below.
  • Start a new search.
Trending Questions
Oracle SQL Developer

Oracle SQL Developer 19.1 Bugs Fixed

April 2019

This list contains only a selection of higher priority bugs, customer bugs and issues raised by the community on the OTN Forum since the previous release. 

29379071 FORUMS: APP HANGS WHEN CHECKING IF CONNECTION IS ALIVE
29521609 FORUMS: TRIGGER SOURCE CODE INCORRECT
29286453 FORUMS: SEARCHING VIEW CODE FOR STRING LITERAL
29266092 FORUMS: PARSING ERROR AND WRONG GROUP BY ADVICE
29474801 FORUMS: BRACE MATCHING FAILURE
29128067 FORUMS: UNRECOGNIZED "LOCK TABLE" SYNTAX
29128216 FORUMS: PARSER CONFUSED BY CASE
29133925 FORUMS:Parser confused by UPDATE RETURNING INTO ARRAY
29141987 FORUMS: PARSER CONFUSED BY DATE KEYWORD IN TYPE DECLARATION
29212343 FORUMS: PARSER CONFUSED BY PL/SQL CONDITIONAL COMPILATION
29222142 FORUMS: HIGHLIGHTING MATCHING PARENTHESIS
29266092 FORUMS: PARSING ERROR AND WRONG GROUP BY ADVICE
29291846 FORUMS: CODE FOLDING MISSING WHEN FILE OPENED IN WORKSHEET
29306340 FORUMS: PARSING confused by IN MEASURES OVER CLAUSE
29306883 FORUMS: PARSER CONFUSED BY CAST(SYS_EXTRACT_UTC(...
29474801 FORUMS: BRACE () MATCHING FAILURE
29021879 CODE EDITOR HANGS WHEN DOING SAVE FOR A PL/SQL PACKAGE
29435823 WARN ON TIME ZONE VERSION DIFFERENT ON AUTONOMOUS DATABASE DATA PUMP IMPORT
28884291 LACK OF SUPPORT FOR JAWS WITH [TOUCH] NAVIGATION
26865752 JAWS NOT READING THE TITLE OF THE NEW CART DIALOG BOX
29465956 EXPLAIN PLAN NOT SHOWN FOR TEST QUERY WHEN CREATE VIEW
29466225 PASSWORD REQUIRED FOR INSTANCE VIEWER EVEN WHEN CONNECTION HAS SAVED PASSWORD 
29252095 INCORRECT COMPRESSION PARAMETERS FOR ROW STORE COMPRESSION ADVANCED
28698368 DATABASE OBJECT WAS NOT UPDATE WHEN RESELECT A TABLE IN THE EXPORT WIZARD
27197273 WORKSHEET RUNNING AND SCRIPT OUTPUT SHOWING IS NOT IN SYNC
28524024 MIGRATING DB2 V9.7 OR 10 TO ORACLE 12 DOESN'T HANDLE IDENTITY COLUMNS
29048867 OBJECT HYPERLINKS ARE NOT DISTINGUISHED
28843867 CONNECTION COMBOBOX DOEN'T SHOW NEWLY ADDED ORACLE CONNECTIONS IN DROPDOWN 
29042296 AUTOTRACE DOES NOT WORK FOR AUTONOMOUS DATA WAREHOUSE
29025276 DISTRACTING HIGHLIGHTING OF BASIC SELECT STATEMENT
29023201 ONLINE GENERATION CREATES A PASSWORD FOR NEW USERS WHICH IS INVALID
29014719 SELECT LOCAL FILE WILL POP UP AN ERROR WHEN CLICKING BROWSE
29142869 FAILED TO IMPORT TSV FILE.
29129694 SQLDEV FAILS IN SCHEMA SERVICE WHEN BROWSING TABLE IN DATA TAB
29193576 PERFORMANCE ISSUES LOADING LARGE LDAP ALIASES LIST
28746230 LDAP DOESN'T LOAD ALL ENTRIES
29142300 SDCLI CART EXPORT AS EXCEL NOT WORKING
29116698 NULLPOINTEREXCEPTION FOR ORDS INSTALL WIZARD
28723387 AUTONOMOUS DATABASE CLOUD DATA PUMP IMPORT FAILED
28486473 ORA-28357 REPORTED WHEN CLONING A PDB USING SQL DEVELOPER
28377838 UNEXPECTED BAD BIND VARIABLE RUNNING SCRIPT WITH :NEW.DEPTNO FOR TRIGGER
29222411 SET SQLFORMAT INSERT, OUTPUT WITH CLOB > 500 BYTES IS INVALID
29279826 QUERY TO SET NLS PARAMATERS CALLED TOO MANY TIMES
29282680 EXPORT QUERY RESULTS TO HTML, IF SEARCH FILTER IS FILLED AND NO RECORDS ARE RETURNED
29368396 AUTONOMOUS DW/TP:FAILED TO ADD COLUMN COMMENT WHEN EDIT VIEW
29510102 FORMATTER BREAKS VALID SQL BY INSERTING SPACES INTO NUMBERS